BDBM50153064 CHEMBL3780285
SMILES NC[C@H]1CC[C@@H](CC1)C(=O)NC(Cc1ccccc1)c1cc(ccn1)-c1ccc2c(N)noc2c1
InChI Key InChIKey=ZKJDQAIHHSXKCI-YYSPQECZSA-N
Data  1 KI
  Tab Delimited (TSV)   2D SDfile   Computed 3D by Vconf -m prep SDfile
Find this compound or compounds like it in BindingDB:
Activity Spreadsheet -- Enzyme Inhibition Constant Data from BindingDB
Found 1 hit for monomerid = 50153064
TargetCoagulation factor XI(Homo sapiens (Human))
Bristol-Myers Squibb
Curated by ChEMBL
LigandPNGBDBM50153064(CHEMBL3780285)
Affinity DataKi:  9.20nM. Assay description: Competitive inhibition of human coagulation factor 11a assessed as reduction in release of p-nitroaniline after 10 to 120 mins by Michaelis-Menten eq...
In DepthDetails ArticlePubMed