BDBM50153202 CHEMBL186491::N-(2-Diethylamino-ethyl)-2-methoxy-4-(4-phenoxy-benzoylamino)-benzamide
SMILES CCN(CC)CCNC(=O)c1ccc(NC(=O)c2ccc(Oc3ccccc3)cc2)cc1OC
InChI Key InChIKey=IZGYVBOGCUZDNQ-UHFFFAOYSA-N
Data  2 IC50
  Tab Delimited (TSV)   2D SDfile   Computed 3D by Vconf -m prep SDfile
Find this compound or compounds like it in BindingDB:
Activity Spreadsheet -- Enzyme Inhibition Constant Data from BindingDB
Found 2 hits for monomerid = 50153202
TargetMelanin-concentrating hormone receptor 1(Homo sapiens (Human))
7Tm Pharma
Curated by ChEMBL
LigandPNGBDBM50153202(CHEMBL186491 | N-(2-Diethylamino-ethyl)-2-methoxy-...)
Affinity DataIC50:  6.81E+3nM. Assay description: Antagonistic activity against human Melanin-concentrating hormone receptor 1 stably transfected CHO cells was determined using IP3 assay
In DepthDetails ArticlePubMed
TargetMelanin-concentrating hormone receptor 1(Homo sapiens (Human))
7Tm Pharma
Curated by ChEMBL
LigandPNGBDBM50153202(CHEMBL186491 | N-(2-Diethylamino-ethyl)-2-methoxy-...)
Affinity DataIC50:  1.97E+3nM. Assay description: Binding affinity against human Melanin-concentrating hormone receptor 1 stably transfected CHO cells was determined using [125I]-MCH as radioligand
In DepthDetails ArticlePubMed