BDBM50153710 3S-hydroxypentan-2-one 5-phosphate
SMILES CC(=O)[C@@H](O)CCOP([O-])([O-])=O
InChI Key InChIKey=RLSIIOFLGWOKDY-YFKPBYRVSA-L
Data  2 KI
  Tab Delimited (TSV)   2D SDfile   Computed 3D by Vconf -m prep SDfile
Find this compound or compounds like it in BindingDB:
Activity Spreadsheet -- Enzyme Inhibition Constant Data from BindingDB
Found 2 hits for monomerid = 50153710
Target1-deoxy-D-xylulose 5-phosphate reductoisomerase(Synechocystis sp. (strain PCC 6803))
Oregon State University
Curated by ChEMBL
LigandPNGBDBM50153710(3S-hydroxypentan-2-one 5-phosphate)
Affinity DataKi:  3.00E+4nM. Assay description: Binding affinity against Synechocystis strain PCC6803 DXP reductoisomerase
In DepthDetails ArticlePubMed
Target1-deoxy-D-xylulose 5-phosphate reductoisomerase(Escherichia coli)
Oregon State University
Curated by ChEMBL
LigandPNGBDBM50153710(3S-hydroxypentan-2-one 5-phosphate)
Affinity DataKi:  1.20E+5nM. Assay description: Inhibitory activity against Escherichia coli deoxyxylulose 5-phosphate reductoisomerase
In DepthDetails ArticlePubMed