BDBM50153756 1-(3-Bromo-2-hydroxy-4-{4-[4-(2H-tetrazol-5-yl)-phenoxy]-butoxy}-phenyl)-3-methyl-butan-1-one::CHEMBL364324
SMILES CC(C)CC(=O)c1ccc(OCCCCOc2ccc(cc2)-c2nnn[nH]2)c(Br)c1O
InChI Key InChIKey=OGRBIYLJRMIQJY-UHFFFAOYSA-N
Data  1 EC50
  Tab Delimited (TSV)   2D SDfile   Computed 3D by Vconf -m prep SDfile
Find this compound or compounds like it in BindingDB:
Activity Spreadsheet -- Enzyme Inhibition Constant Data from BindingDB
Found 1 hit for monomerid = 50153756
TargetMetabotropic glutamate receptor 2(Homo sapiens (Human))
Merck Research Laboratories
Curated by ChEMBL
LigandPNGBDBM50153756(1-(3-Bromo-2-hydroxy-4-{4-[4-(2H-tetrazol-5-yl)-ph...)
Affinity DataEC50:  93nM. Assay description: Effective concentration for binding to human metabotropic glutamate receptor 2 as determined by GTPgammaS assay
In DepthDetails ArticlePubMed