BDBM50154048 3-(5-Hydroxy-naphthalen-1-yl)-benzo[d]isoxazol-6-ol::3-(5-hydroxynaphthalen-1-yl)benzo[d]isoxazol-6-ol::CHEMBL188051
SMILES Oc1ccc2c(noc2c1)-c1cccc2c(O)cccc12
InChI Key InChIKey=UYBIVRLEZVLKDU-UHFFFAOYSA-N
Data  3 IC50
  Tab Delimited (TSV)   2D SDfile   Computed 3D by Vconf -m prep SDfile
Find this compound or compounds like it in BindingDB:
Activity Spreadsheet -- Enzyme Inhibition Constant Data from BindingDB
Found 3 hits for monomerid = 50154048
TargetEstrogen receptor beta(Homo sapiens (Human))
Wyeth Research
Curated by ChEMBL
LigandPNGBDBM50154048(3-(5-Hydroxy-naphthalen-1-yl)-benzo[d]isoxazol-6-o...)
Affinity DataIC50:  1.5nM. Assay description: Inhibitory concentration against human ER beta expressed in Escherichia coli was determined using [3H]17-beta-estradiol as radio ligand
In DepthDetails ArticlePubMed
TargetEstrogen receptor beta(Homo sapiens (Human))
Wyeth Research
Curated by ChEMBL
LigandPNGBDBM50154048(3-(5-Hydroxy-naphthalen-1-yl)-benzo[d]isoxazol-6-o...)
Affinity DataIC50:  1.5nM. Assay description: Binding affinity to ERbeta (unknown origin)
In DepthDetails ArticlePubMed
TargetEstrogen receptor(Homo sapiens (Human))
Wyeth Research
Curated by ChEMBL
LigandPNGBDBM50154048(3-(5-Hydroxy-naphthalen-1-yl)-benzo[d]isoxazol-6-o...)
Affinity DataIC50:  6nM. Assay description: Inhibitory concentration against human ER alpha expressed in Escherichia coli was determined using [3H]17-beta-estradiol as radio ligand
In DepthDetails ArticlePubMed