BDBM50154125 2-(4-Hydroxy-phenyl)-7-phenyl-benzooxazol-5-ol::2-(4-hydroxyphenyl)-7-phenylbenzo[d]oxazol-5-ol::CHEMBL185783
SMILES Oc1ccc(cc1)-c1nc2cc(O)cc(-c3ccccc3)c2o1
InChI Key InChIKey=OMOPCSHWHZVQPY-UHFFFAOYSA-N
Data  3 IC50
  Tab Delimited (TSV)   2D SDfile   Computed 3D by Vconf -m prep SDfile
Find this compound or compounds like it in BindingDB:
Activity Spreadsheet -- Enzyme Inhibition Constant Data from BindingDB
Found 3 hits for monomerid = 50154125
TargetEstrogen receptor(Homo sapiens (Human))
Wyeth Research
Curated by ChEMBL
LigandPNGBDBM50154125(2-(4-Hydroxy-phenyl)-7-phenyl-benzooxazol-5-ol | 2...)
Affinity DataIC50:  1.30E+3nM. Assay description: Inhibitory concentration against human ER alpha expressed in Escherichia coli was determined using [3H]17-beta-estradiol as radio ligand
In DepthDetails ArticlePubMed
TargetEstrogen receptor beta(Homo sapiens (Human))
Yantai University
Curated by ChEMBL
LigandPNGBDBM50154125(2-(4-Hydroxy-phenyl)-7-phenyl-benzooxazol-5-ol | 2...)
Affinity DataIC50:  235nM. Assay description: Binding affinity to ERbeta (unknown origin)
In DepthDetails ArticlePubMed
TargetEstrogen receptor beta(Homo sapiens (Human))
Yantai University
Curated by ChEMBL
LigandPNGBDBM50154125(2-(4-Hydroxy-phenyl)-7-phenyl-benzooxazol-5-ol | 2...)
Affinity DataIC50:  235nM. Assay description: Inhibitory concentration against human ER beta expressed in Escherichia coli was determined using [3H]17-beta-estradiol as radio ligand
In DepthDetails ArticlePubMed