BDBM50154336 (S)-3-Phenyl-2-[3-(4-sulfamoyl-phenyl)-thioureido]-propionic acid methylcarbamoylmethyl with resin::CHEMBL362892
SMILES CNC(=O)COC(=O)[C@H](Cc1ccccc1)NC(=S)Nc1ccc(cc1)S(N)(=O)=O
InChI Key InChIKey=XWVDCIAEIKEQHI-INIZCTEOSA-N
Data  2 KI
  Tab Delimited (TSV)   2D SDfile   Computed 3D by Vconf -m prep SDfile
Find this compound or compounds like it in BindingDB:
Activity Spreadsheet -- Enzyme Inhibition Constant Data from BindingDB
Found 2 hits for monomerid = 50154336
TargetCarbonic anhydrase 2(Homo sapiens (Human))
University Of Florence
Curated by ChEMBL
LigandPNGBDBM50154336((S)-3-Phenyl-2-[3-(4-sulfamoyl-phenyl)-thioureido]...)
Affinity DataKi:  8nM. Assay description: Inhibitory activity against human Carbonic anhydrase II
In DepthDetails ArticlePubMed
TargetCarbonic anhydrase 1(Homo sapiens (Human))
University Of Florence
Curated by ChEMBL
LigandPNGBDBM50154336((S)-3-Phenyl-2-[3-(4-sulfamoyl-phenyl)-thioureido]...)
Affinity DataKi:  42nM. Assay description: Inhibitory activity against human Carbonic anhydrase I
In DepthDetails ArticlePubMed