BDBM50154746 6-(4-Chloro-phenyl)-1-oxo-1,2,3,4-tetrahydro-[1,4]diazepino[6,7,1-hi]indole-7-carbaldehyde::CHEMBL188743
SMILES Clc1ccc(cc1)-c1c(C=O)c2cccc3C(=O)NCCn1c23
InChI Key InChIKey=MZTVXNDEQKZCIB-UHFFFAOYSA-N
Data  1 KI
  Tab Delimited (TSV)   2D SDfile   Computed 3D by Vconf -m prep SDfile
Find this compound or compounds like it in BindingDB:
Activity Spreadsheet -- Enzyme Inhibition Constant Data from BindingDB
Found 1 hit for monomerid = 50154746
TargetPoly [ADP-ribose] polymerase 1(Homo sapiens (Human))
Pfizer
Curated by ChEMBL
LigandPNGBDBM50154746(6-(4-Chloro-phenyl)-1-oxo-1,2,3,4-tetrahydro-[1,4]...)
Affinity DataKi:  43nM. Assay description: Inhibition of human Poly (ADP-ribose) polymerase 1 enzyme
In DepthDetails ArticlePubMed