BDBM50154747 1-Oxo-1,2,3,4-tetrahydro-[1,4]diazepino[6,7,1-hi]indole-7-carbaldehyde::CHEMBL187720
SMILES O=Cc1cn2CCNC(=O)c3cccc1c23
InChI Key InChIKey=LPSHBZHLXZXCKO-UHFFFAOYSA-N
Data  1 KI
  Tab Delimited (TSV)   2D SDfile   Computed 3D by Vconf -m prep SDfile
Find this compound or compounds like it in BindingDB:
Activity Spreadsheet -- Enzyme Inhibition Constant Data from BindingDB
Found 1 hit for monomerid = 50154747
TargetPoly [ADP-ribose] polymerase 1(Homo sapiens (Human))
Pfizer
Curated by ChEMBL
LigandPNGBDBM50154747(1-Oxo-1,2,3,4-tetrahydro-[1,4]diazepino[6,7,1-hi]i...)
Affinity DataKi:  176nM. Assay description: Inhibition of human Poly (ADP-ribose) polymerase 1 enzyme
In DepthDetails ArticlePubMed