BDBM50154752 7-Methyl-3,4-dihydro-2H-[1,4]diazepino[6,7,1-hi]indol-1-one::CHEMBL188217
SMILES Cc1cn2CCNC(=O)c3cccc1c23
InChI Key InChIKey=JRCJWEHAUDLWIE-UHFFFAOYSA-N
Data  1 KI
  Tab Delimited (TSV)   2D SDfile   Computed 3D by Vconf -m prep SDfile
Find this compound or compounds like it in BindingDB:
Activity Spreadsheet -- Enzyme Inhibition Constant Data from BindingDB
Found 1 hit for monomerid = 50154752
TargetPoly [ADP-ribose] polymerase 1(Homo sapiens (Human))
Pfizer
Curated by ChEMBL
LigandPNGBDBM50154752(7-Methyl-3,4-dihydro-2H-[1,4]diazepino[6,7,1-hi]in...)
Affinity DataKi:  122nM. Assay description: Inhibition of human Poly (ADP-ribose) polymerase 1 enzyme
In DepthDetails ArticlePubMed