BDBM50154988 3''-Fluoro-5''-(5-pyridin-2-yl-tetrazol-2-yl)-biphenyl-2-ylamine::CHEMBL185673
SMILES Nc1ccccc1-c1cc(F)cc(c1)-n1nnc(n1)-c1ccccn1
InChI Key InChIKey=ULFHBMQFSGPZSK-UHFFFAOYSA-N
Data  1 KI  1 IC50
  Tab Delimited (TSV)   2D SDfile   Computed 3D by Vconf -m prep SDfile
Find this compound or compounds like it in BindingDB:
Activity Spreadsheet -- Enzyme Inhibition Constant Data from BindingDB
Found 2 hits for monomerid = 50154988
TargetMetabotropic glutamate receptor 5(Rattus norvegicus (Rat))
Merck Research Laboratories
Curated by ChEMBL
LigandPNGBDBM50154988(3''-Fluoro-5''-(5-pyridin-2-yl-tetrazol-2-yl)-biph...)
Affinity DataKi:  7nM. Assay description: Binding affinity towards Metabotropic glutamate receptor was determined by displacing [3H]-3-methoxy-5-(pyridin-2-ylethynyl)pyridine from rat cortica...
In DepthDetails ArticlePubMed
TargetMetabotropic glutamate receptor 5(Rattus norvegicus (Rat))
Merck Research Laboratories
Curated by ChEMBL
LigandPNGBDBM50154988(3''-Fluoro-5''-(5-pyridin-2-yl-tetrazol-2-yl)-biph...)
Affinity DataIC50:  8nM. Assay description: Antagonistic activity of the compound against Metabotropic glutamate receptor 5 in [Ca2+] flux assay using glutamate (10 uM) as agonist
In DepthDetails ArticlePubMed