BDBM50154992 5-[3-Fluoro-5-(5-pyridin-2-yl-tetrazol-2-yl)-phenyl]-2-methyl-pyridine::CHEMBL187297
SMILES Cc1ccc(cn1)-c1cc(F)cc(c1)-n1nnc(n1)-c1ccccn1
InChI Key InChIKey=OTZBMMKXZRXZSQ-UHFFFAOYSA-N
Data  1 KI  1 IC50
  Tab Delimited (TSV)   2D SDfile   Computed 3D by Vconf -m prep SDfile
Find this compound or compounds like it in BindingDB:
Activity Spreadsheet -- Enzyme Inhibition Constant Data from BindingDB
Found 2 hits for monomerid = 50154992
TargetMetabotropic glutamate receptor 5(Rattus norvegicus (Rat))
Merck Research Laboratories
Curated by ChEMBL
LigandPNGBDBM50154992(5-[3-Fluoro-5-(5-pyridin-2-yl-tetrazol-2-yl)-pheny...)
Affinity DataKi:  36nM. Assay description: Binding affinity towards Metabotropic glutamate receptor was determined by displacing [3H]-3-methoxy-5-(pyridin-2-ylethynyl)pyridine from rat cortica...
In DepthDetails ArticlePubMed
TargetMetabotropic glutamate receptor 5(Rattus norvegicus (Rat))
Merck Research Laboratories
Curated by ChEMBL
LigandPNGBDBM50154992(5-[3-Fluoro-5-(5-pyridin-2-yl-tetrazol-2-yl)-pheny...)
Affinity DataIC50:  57nM. Assay description: Antagonistic activity of the compound against Metabotropic glutamate receptor 5 in [Ca2+] flux assay using glutamate (10 uM) as agonist
In DepthDetails ArticlePubMed