BDBM50155142 CHEMBL187278::[2-(1-Benzenesulfonyl-1H-indol-3-yl)-ethyl]-methyl-amine
SMILES CNCCc1cn(c2ccccc12)S(=O)(=O)c1ccccc1
InChI Key InChIKey=SYEDBQQYWDGLOO-UHFFFAOYSA-N
Data  1 KI
  Tab Delimited (TSV)   2D SDfile   Computed 3D by Vconf -m prep SDfile
Find this compound or compounds like it in BindingDB:
Activity Spreadsheet -- Enzyme Inhibition Constant Data from BindingDB
Found 1 hit for monomerid = 50155142
Target5-hydroxytryptamine receptor 6(Homo sapiens (Human))
Wyeth Research
Curated by ChEMBL
LigandPNGBDBM50155142(CHEMBL187278 | [2-(1-Benzenesulfonyl-1H-indol-3-yl...)
Affinity DataKi:  5nM. Assay description: Binding affinity against human 5-hydroxytryptamine 6 receptor transfected in HeLa cells
In DepthDetails ArticlePubMed