BDBM50155185 4-Phthalazin-1-yl-piperazine-1-carboxylic acid (4-trifluoromethyl-phenyl)-amide::CHEMBL185503
SMILES FC(F)(F)c1ccc(NC(=O)N2CCN(CC2)c2nncc3ccccc23)cc1
InChI Key InChIKey=ZEGPQYHWMWQQRE-UHFFFAOYSA-N
Data  2 IC50
  Tab Delimited (TSV)   2D SDfile   Computed 3D by Vconf -m prep SDfile
Find this compound or compounds like it in BindingDB:
Activity Spreadsheet -- Enzyme Inhibition Constant Data from BindingDB
Found 2 hits for monomerid = 50155185
TargetTransient receptor potential cation channel subfamily V member 1(Homo sapiens (Human))
Purdue Pharma
Curated by ChEMBL
LigandPNGBDBM50155185(4-Phthalazin-1-yl-piperazine-1-carboxylic acid (4-...)
Affinity DataIC50: >1.00E+4nMpH: 5.5Assay Description:Inhibition of human vanilloid receptor 1 in HEK293 cells in pH 5.5-induced FLIPR assay
In DepthDetails ArticlePubMed
TargetTransient receptor potential cation channel subfamily V member 1(Homo sapiens (Human))
Purdue Pharma
Curated by ChEMBL
LigandPNGBDBM50155185(4-Phthalazin-1-yl-piperazine-1-carboxylic acid (4-...)
Affinity DataIC50: >1.00E+4nM. Assay description: Inhibition of human vanilloid receptor 1 in HEK293 cells in capsaicin-induced FLIPR assay
In DepthDetails ArticlePubMed