BDBM50155561 4-Methyl-piperazine-1-carboxylic acid [4-methyl-3-(4-pyridin-3-yl-pyrimidin-2-ylamino)-phenyl]-amide::CHEMBL185834
SMILES CN1CCN(CC1)C(=O)Nc1ccc(C)c(Nc2nccc(n2)-c2cccnc2)c1
InChI Key InChIKey=VYFIDSAYCONWQP-UHFFFAOYSA-N
Data  2 IC50
  Tab Delimited (TSV)   2D SDfile   Computed 3D by Vconf -m prep SDfile
Find this compound or compounds like it in BindingDB:
Activity Spreadsheet -- Enzyme Inhibition Constant Data from BindingDB
Found 2 hits for monomerid = 50155561
TargetBreakpoint cluster region protein/Tyrosine-protein kinase ABL1(Homo sapiens (Human))
The First People'S Hospital Of Hangzhou
Curated by ChEMBL
LigandPNGBDBM50155561(4-Methyl-piperazine-1-carboxylic acid [4-methyl-3-...)
Affinity DataIC50:  5.01E+3nM. Assay description: Inhibition of BCR-ABL kinase (unknown origin)
In DepthDetails ArticlePubMed
TargetBreakpoint cluster region protein(Homo sapiens (Human))
Novartis Institutes For Biomedical Research
Curated by ChEMBL
LigandPNGBDBM50155561(4-Methyl-piperazine-1-carboxylic acid [4-methyl-3-...)
Affinity DataIC50: >5.00E+3nM. Assay description: Inhibitory concentration required to inhibit Bcr-Abl tyrosine kinase
In DepthDetails ArticlePubMed