BDBM50155646 3-(4-Hydroxy-piperidin-1-yl)-N-{6-[3-(4-hydroxy-piperidin-1-yl)-propionylamino]-9-oxo-9,10-dihydro-acridin-2-yl}-propionamide::CHEMBL1079146::CHEMBL186346
SMILES OC1CCN(CCC(=O)Nc2ccc3c(O)c4cc(NC(=O)CCN5CCC(O)CC5)ccc4nc3c2)CC1
InChI Key InChIKey=ALJIHEDQQKQVAW-UHFFFAOYSA-N
Data  1 IC50  1 EC50
  Tab Delimited (TSV)   2D SDfile   Computed 3D by Vconf -m prep SDfile
Find this compound or compounds like it in BindingDB:
Activity Spreadsheet -- Enzyme Inhibition Constant Data from BindingDB
Found 2 hits for monomerid = 50155646
TargetTelomerase reverse transcriptase(Homo sapiens (Human))
Central University Of Las Villas
Curated by ChEMBL
LigandPNGBDBM50155646(3-(4-Hydroxy-piperidin-1-yl)-N-{6-[3-(4-hydroxy-pi...)
Affinity DataIC50:  200nM. Assay description: Inhibition of telomerase in human A2780 cells by TRAP assay
In DepthDetails ArticlePubMed
TargetTelomerase reverse transcriptase(Homo sapiens (Human))
Central University Of Las Villas
Curated by ChEMBL
LigandPNGBDBM50155646(3-(4-Hydroxy-piperidin-1-yl)-N-{6-[3-(4-hydroxy-pi...)
Affinity DataEC50:  200nM. Assay description: Concentration required to inhibit 50% of telomerase activity
In DepthDetails ArticlePubMed