BDBM50155695 1-{2-Hydroxy-3-methyl-4-[2-(pyridin-4-ylsulfanyl)-benzyloxy]-phenyl}-3-methyl-butan-1-one::CHEMBL183304
SMILES CC(C)CC(=O)c1ccc(OCc2ccccc2Sc2ccncc2)c(C)c1O
InChI Key InChIKey=WHIFAHNILXSDGV-UHFFFAOYSA-N
Data  1 EC50
  Tab Delimited (TSV)   2D SDfile   Computed 3D by Vconf -m prep SDfile
Find this compound or compounds like it in BindingDB:
Activity Spreadsheet -- Enzyme Inhibition Constant Data from BindingDB
Found 1 hit for monomerid = 50155695
TargetMetabotropic glutamate receptor 2(Homo sapiens (Human))
Merck Research Laboratories
Curated by ChEMBL
LigandPNGBDBM50155695(1-{2-Hydroxy-3-methyl-4-[2-(pyridin-4-ylsulfanyl)-...)
Affinity DataEC50:  677nM. Assay description: Binding affinity towards human metabotropic glutamate receptor 2 determined by [35S]-GTP gama S binding assay
In DepthDetails ArticlePubMed