BDBM50155789 (S)-3-Propyl-[1,4]thiazepan-(5E)-ylideneamine::CHEMBL186431
SMILES CCC[C@H]1CSCCC(N)=N1
InChI Key InChIKey=SWOQAUBWIBZBLQ-ZETCQYMHSA-N
Data  3 IC50
  Tab Delimited (TSV)   2D SDfile   Computed 3D by Vconf -m prep SDfile
Find this compound or compounds like it in BindingDB:
Activity Spreadsheet -- Enzyme Inhibition Constant Data from BindingDB
Found 3 hits for monomerid = 50155789
TargetNitric oxide synthase, endothelial(Homo sapiens (Human))
Merck Research Laboratories
Curated by ChEMBL
LigandPNGBDBM50155789((S)-3-Propyl-[1,4]thiazepan-(5E)-ylideneamine | CH...)
Affinity DataIC50:  1.00E+3nM. Assay description: Inhibitory concentration against Endothelial nitric oxide synthase
In DepthDetails ArticlePubMed
TargetNitric oxide synthase, brain(Homo sapiens (Human))
Merck Research Laboratories
Curated by ChEMBL
LigandPNGBDBM50155789((S)-3-Propyl-[1,4]thiazepan-(5E)-ylideneamine | CH...)
Affinity DataIC50:  440nM. Assay description: Inhibitory concentration against Neuronal nitric oxide synthase
In DepthDetails ArticlePubMed
TargetNitric oxide synthase, inducible(Homo sapiens (Human))
Merck Research Laboratories
Curated by ChEMBL
LigandPNGBDBM50155789((S)-3-Propyl-[1,4]thiazepan-(5E)-ylideneamine | CH...)
Affinity DataIC50:  190nM. Assay description: Inhibitory concentration against Inducible nitric oxide synthase
In DepthDetails ArticlePubMed