BDBM50156 (Z)-3-(2-chlorophenyl)-N-[4-(diethylamino)phenyl]-2-propenamide::(Z)-3-(2-chlorophenyl)-N-[4-(diethylamino)phenyl]acrylamide::(Z)-3-(2-chlorophenyl)-N-[4-(diethylamino)phenyl]prop-2-enamide::MLS000579776::SMR000186510::cid_1556087
SMILES CCN(CC)c1ccc(NC(=O)\C=C/c2ccccc2Cl)cc1
InChI Key InChIKey=TVIYXXFKSQTYGQ-ZROIWOOFSA-N
Data  1 IC50
  Tab Delimited (TSV)   2D SDfile   Computed 3D by Vconf -m prep SDfile
Find this compound or compounds like it in BindingDB:
Activity Spreadsheet -- Enzyme Inhibition Constant Data from BindingDB
Found 1 hit for monomerid = 50156
TargetInduced myeloid leukemia cell differentiation protein Mcl-1(Homo sapiens (Human))
Emory University
Curated by PubChem BioAssay
LigandPNGBDBM50156((Z)-3-(2-chlorophenyl)-N-[4-(diethylamino)phenyl]-...)
Affinity DataIC50:  400nM. Assay description: NIH Molecular Libraries Screening Centers Network [MLSCN] Emory Chemical Biology Discovery Center in MLSCN Assay provider: Nikolovska-Coleska, Univer...
In DepthDetails PCBioAssay