BDBM50156440 (R)-1-{2,2-Dimethyl-4-[3-(4-trifluoromethyl-phenyl)-[1,2,4]oxadiazol-5-ylmethyl]-piperazin-1-yl}-3-(2-methyl-benzothiazol-5-yloxy)-propan-2-ol::CHEMBL186685
SMILES Cc1nc2cc(OC[C@H](O)CN3CCN(Cc4nc(no4)-c4ccc(cc4)C(F)(F)F)CC3(C)C)ccc2s1
InChI Key InChIKey=KDWWMZSKWWXLKU-HXUWFJFHSA-N
Data  1 IC50
  Tab Delimited (TSV)   2D SDfile   Computed 3D by Vconf -m prep SDfile
Find this compound or compounds like it in BindingDB:
Activity Spreadsheet -- Enzyme Inhibition Constant Data from BindingDB
Found 1 hit for monomerid = 50156440
TargetPeroxisomal acyl-coenzyme A oxidase 1(Rattus norvegicus)
Cv Therapeutics
Curated by ChEMBL
LigandPNGBDBM50156440((R)-1-{2,2-Dimethyl-4-[3-(4-trifluoromethyl-phenyl...)
Affinity DataIC50:  9.70E+3nM. Assay description: Inhibition of palmitoyl-CoA oxidation in rat heart mitochondria
In DepthDetails ArticlePubMed