BDBM50156554 4-(2-((R)-2-((S,E)-3-hydroxyoct-1-enyl)-5-oxopyrrolidin-1-yl)ethylthio)butanoic acid::CHEMBL223151
SMILES CCCCC[C@H](O)\C=C\[C@H]1CCC(=O)N1CCSCCCC(O)=O
InChI Key InChIKey=LDTVAEAOOFGOEC-OZVGAOPWSA-N
Data  11 KI  3 EC50
  Tab Delimited (TSV)   2D SDfile   Computed 3D by Vconf -m prep SDfile
Find this compound or compounds like it in BindingDB:
Activity Spreadsheet -- Enzyme Inhibition Constant Data from BindingDB
Found 14 hits for monomerid = 50156554
TargetProstaglandin E2 receptor EP4 subtype(Mus musculus (Mouse))
Minase Research Institute
Curated by ChEMBL
LigandPNGBDBM50156554(4-(2-((R)-2-((S,E)-3-hydroxyoct-1-enyl)-5-oxopyrro...)
Affinity DataKi:  2nM. Assay description: Displacement of [3H]-PGE2 from mouse EP4 receptor expressed in CHO cells after 60 mins by scintillation counting
In DepthDetails ArticlePubMed
TargetProstaglandin E2 receptor EP4 subtype(Mus musculus (Mouse))
Minase Research Institute
Curated by ChEMBL
LigandPNGBDBM50156554(4-(2-((R)-2-((S,E)-3-hydroxyoct-1-enyl)-5-oxopyrro...)
Affinity DataKi:  2nM. Assay description: Displacement of [3H]-PGE2 from mouse EP4 receptor expressed in CHO cells after 60 mins by liquid scintillation counting
In DepthDetails ArticlePubMed
TargetProstaglandin E2 receptor EP4 subtype(Homo sapiens (Human))
Roche Palo Alto
Curated by ChEMBL
LigandPNGBDBM50156554(4-(2-((R)-2-((S,E)-3-hydroxyoct-1-enyl)-5-oxopyrro...)
Affinity DataKi:  3.80nM. Assay description: Binding affinity to human EP4 receptor
In DepthDetails ArticlePubMed
TargetProstaglandin E2 receptor EP3 subtype(Mus musculus (Mouse))
Minase Research Institute
Curated by ChEMBL
LigandPNGBDBM50156554(4-(2-((R)-2-((S,E)-3-hydroxyoct-1-enyl)-5-oxopyrro...)
Affinity DataKi:  26nM. Assay description: Displacement of [3H]-PGE2 from mouse EP3 receptor expressed in CHO cells after 60 mins by scintillation counting
In DepthDetails ArticlePubMed
TargetProstaglandin E2 receptor EP3 subtype(Mus musculus (Mouse))
Minase Research Institute
Curated by ChEMBL
LigandPNGBDBM50156554(4-(2-((R)-2-((S,E)-3-hydroxyoct-1-enyl)-5-oxopyrro...)
Affinity DataKi:  26nM. Assay description: Displacement of [3H]-PGE2 from mouse EP3 receptor expressed in CHO cells after 60 mins by liquid scintillation counting
In DepthDetails ArticlePubMed
TargetProstaglandin E2 receptor EP3 subtype(Homo sapiens (Human))
Roche Palo Alto
Curated by ChEMBL
LigandPNGBDBM50156554(4-(2-((R)-2-((S,E)-3-hydroxyoct-1-enyl)-5-oxopyrro...)
Affinity DataKi:  1.90E+3nM. Assay description: Binding affinity to human EP3 receptor
In DepthDetails ArticlePubMed
TargetProstaglandin E2 receptor EP2 subtype(Mus musculus (Mouse))
Minase Research Institute
Curated by ChEMBL
LigandPNGBDBM50156554(4-(2-((R)-2-((S,E)-3-hydroxyoct-1-enyl)-5-oxopyrro...)
Affinity DataKi:  2.50E+3nM. Assay description: Displacement of [3H]-PGE2 from mouse EP2 receptor expressed in CHO cells after 60 mins by scintillation counting
In DepthDetails ArticlePubMed
TargetProstaglandin E2 receptor EP2 subtype(Mus musculus (Mouse))
Minase Research Institute
Curated by ChEMBL
LigandPNGBDBM50156554(4-(2-((R)-2-((S,E)-3-hydroxyoct-1-enyl)-5-oxopyrro...)
Affinity DataKi:  2.50E+3nM. Assay description: Displacement of [3H]-PGE2 from mouse EP2 receptor expressed in CHO cells after 60 mins by liquid scintillation counting
In DepthDetails ArticlePubMed
TargetProstaglandin E2 receptor EP2 subtype(Homo sapiens (Human))
Roche Palo Alto
Curated by ChEMBL
LigandPNGBDBM50156554(4-(2-((R)-2-((S,E)-3-hydroxyoct-1-enyl)-5-oxopyrro...)
Affinity DataKi:  4.70E+3nM. Assay description: Binding affinity to human EP2 receptor
In DepthDetails ArticlePubMed
TargetProstaglandin E2 receptor EP1 subtype(Mus musculus (Mouse))
Minase Research Institute
Curated by ChEMBL
LigandPNGBDBM50156554(4-(2-((R)-2-((S,E)-3-hydroxyoct-1-enyl)-5-oxopyrro...)
Affinity DataKi: >1.00E+4nM. Assay description: Displacement of [3H]-PGE2 from mouse EP1 receptor expressed in CHO cells after 60 mins by scintillation counting
In DepthDetails ArticlePubMed
TargetProstaglandin E2 receptor EP1 subtype(Mus musculus (Mouse))
Minase Research Institute
Curated by ChEMBL
LigandPNGBDBM50156554(4-(2-((R)-2-((S,E)-3-hydroxyoct-1-enyl)-5-oxopyrro...)
Affinity DataKi: >1.00E+4nM. Assay description: Displacement of [3H]-PGE2 from mouse EP1 receptor expressed in CHO cells after 20 mins by liquid scintillation counting
In DepthDetails ArticlePubMed
TargetProstaglandin E2 receptor EP4 subtype(Homo sapiens (Human))
Roche Palo Alto
Curated by ChEMBL
LigandPNGBDBM50156554(4-(2-((R)-2-((S,E)-3-hydroxyoct-1-enyl)-5-oxopyrro...)
Affinity DataEC50:  17nM. Assay description: Functional activity at human EP4 receptor
In DepthDetails ArticlePubMed
TargetProstaglandin E2 receptor EP2 subtype(Rattus norvegicus)
Minase Research Institute
Curated by ChEMBL
LigandPNGBDBM50156554(4-(2-((R)-2-((S,E)-3-hydroxyoct-1-enyl)-5-oxopyrro...)
Affinity DataEC50: >1.00E+4nM. Assay description: Agonist activity at rat EP2 receptor
In DepthDetails ArticlePubMed
TargetProstaglandin E2 receptor EP4 subtype(Rattus norvegicus)
Minase Research Institute
Curated by ChEMBL
LigandPNGBDBM50156554(4-(2-((R)-2-((S,E)-3-hydroxyoct-1-enyl)-5-oxopyrro...)
Affinity DataEC50:  2nM. Assay description: Agonist activity at rat EP4 receptor
In DepthDetails ArticlePubMed