BDBM50156790 CHEMBL3792549
SMILES NCC(C(=O)Nc1ccc2cnccc2c1)c1ccccc1Cl
InChI Key InChIKey=HLWGVAQBKGLZSV-UHFFFAOYSA-N
Data  1 KI
  Tab Delimited (TSV)   2D SDfile   Computed 3D by Vconf -m prep SDfile
Find this compound or compounds like it in BindingDB:
Activity Spreadsheet -- Enzyme Inhibition Constant Data from BindingDB
Found 1 hit for monomerid = 50156790
TargetRho-associated protein kinase 2(Homo sapiens (Human))
Aerie Pharmaceuticals
Curated by ChEMBL
LigandPNGBDBM50156790(CHEMBL3792549)
Affinity DataKi:  1.30nM. Assay description: Inhibition of ROCK2 (unknown origin) using RSK2 peptide (KKRNRTLTK) as substrate after 180 mins by luminescent kinase assay
In DepthDetails ArticlePubMed