BDBM50156825 CHEMBL373808::N-{4-[3-(2-dimethylaminoethyl)-5-(4-fluorophenyl)-2-methylsulfanyl-3H-imidazol-4-yl]pyridin-2-yl}acetamide
SMILES CSc1nc(c(-c2ccnc(NC(C)=O)c2)n1CCN(C)C)-c1ccc(F)cc1
InChI Key InChIKey=KLCPOECSBIOLBI-UHFFFAOYSA-N
Data  1 IC50
  Tab Delimited (TSV)   2D SDfile   Computed 3D by Vconf -m prep SDfile
Find this compound or compounds like it in BindingDB:
Activity Spreadsheet -- Enzyme Inhibition Constant Data from BindingDB
Found 1 hit for monomerid = 50156825
TargetMitogen-activated protein kinase 14(Homo sapiens (Human))
Eberhard-Karls-University TüBingen
Curated by ChEMBL
LigandPNGBDBM50156825(CHEMBL373808 | N-{4-[3-(2-dimethylaminoethyl)-5-(4...)
Affinity DataIC50:  2.41E+3nM. Assay description: Inhibition of mitogen-activated protein kinase p38 alpha
In DepthDetails ArticlePubMed