BDBM50156991 CHEMBL427137::N-[1-(3,3-Diphenyl-propyl)-piperidin-4-yl]-3,3,N-trimethyl-butyramide
SMILES CN(C1CCN(CCC(c2ccccc2)c2ccccc2)CC1)C(=O)CC(C)(C)C
InChI Key InChIKey=AJPBIERWPWHRHF-UHFFFAOYSA-N
Data  1 IC50
  Tab Delimited (TSV)   2D SDfile   Computed 3D by Vconf -m prep SDfile
Find this compound or compounds like it in BindingDB:
Activity Spreadsheet -- Enzyme Inhibition Constant Data from BindingDB
Found 1 hit for monomerid = 50156991
TargetC-C chemokine receptor type 5(Homo sapiens (Human))
Astrazeneca
Curated by ChEMBL
LigandPNGBDBM50156991(CHEMBL427137 | N-[1-(3,3-Diphenyl-propyl)-piperidi...)
Affinity DataIC50:  5.50E+3nM. Assay description: Binding of [125I]-RANTES to membranes prepared from chinese hamster ovary (CHO) cells stably expressing recombinant human C-C chemokine receptor type...
In DepthDetails ArticlePubMed