BDBM50157004 2-(4-Cyano-phenyl)-N-[1-(3,3-diphenyl-propyl)-piperidin-4-yl]-N-ethyl-acetamide::CHEMBL182279
SMILES CCN(C1CCN(CCC(c2ccccc2)c2ccccc2)CC1)C(=O)Cc1ccc(cc1)C#N
InChI Key InChIKey=VCGPLRYYPFNQSB-UHFFFAOYSA-N
Data  1 IC50
  Tab Delimited (TSV)   2D SDfile   Computed 3D by Vconf -m prep SDfile
Find this compound or compounds like it in BindingDB:
Activity Spreadsheet -- Enzyme Inhibition Constant Data from BindingDB
Found 1 hit for monomerid = 50157004
TargetC-C chemokine receptor type 5(Homo sapiens (Human))
Astrazeneca
Curated by ChEMBL
LigandPNGBDBM50157004(2-(4-Cyano-phenyl)-N-[1-(3,3-diphenyl-propyl)-pipe...)
Affinity DataIC50:  66nM. Assay description: Binding of [125I]-RANTES to membranes prepared from chinese hamster ovary (CHO) cells stably expressing recombinant human C-C chemokine receptor type...
In DepthDetails ArticlePubMed