BDBM50157056 (S)-2-Methoxy-3-{4-[3-(4-phenoxy-phenoxy)-propoxy]-phenyl}-propionic acid::CHEMBL181954
SMILES CO[C@@H](Cc1ccc(OCCCOc2ccc(Oc3ccccc3)cc2)cc1)C(O)=O
InChI Key InChIKey=OKJHGOPITGTTIM-DEOSSOPVSA-N
Data  6 IC50  4 EC50
  Tab Delimited (TSV)   2D SDfile   Computed 3D by Vconf -m prep SDfile
Find this compound or compounds like it in BindingDB:
Activity Spreadsheet -- Enzyme Inhibition Constant Data from BindingDB
Found 10 hits for monomerid = 50157056
TargetPeroxisome proliferator-activated receptor gamma(Homo sapiens (Human))
Eli Lilly
Curated by ChEMBL
LigandPNGBDBM50157056((S)-2-Methoxy-3-{4-[3-(4-phenoxy-phenoxy)-propoxy]...)
Affinity DataEC50:  361nM. Assay description: Mean effective concentration against human peroxisome proliferator-activated receptor gamma
In DepthDetails ArticlePubMed
TargetPeroxisome proliferator-activated receptor alpha(Homo sapiens (Human))
Eli Lilly
Curated by ChEMBL
LigandPNGBDBM50157056((S)-2-Methoxy-3-{4-[3-(4-phenoxy-phenoxy)-propoxy]...)
Affinity DataEC50:  2.82E+3nM. Assay description: Mean effective concentration against human peroxisome proliferator activated receptor alpha
In DepthDetails ArticlePubMed
TargetPeroxisome proliferator-activated receptor delta(Homo sapiens (Human))
Eli Lilly
Curated by ChEMBL
LigandPNGBDBM50157056((S)-2-Methoxy-3-{4-[3-(4-phenoxy-phenoxy)-propoxy]...)
Affinity DataIC50:  1.92E+3nM. Assay description: Mean inhibitory concentration against human peroxisome proliferator-activated receptor delta
In DepthDetails ArticlePubMed
TargetPeroxisome proliferator-activated receptor gamma(Homo sapiens (Human))
Eli Lilly
Curated by ChEMBL
LigandPNGBDBM50157056((S)-2-Methoxy-3-{4-[3-(4-phenoxy-phenoxy)-propoxy]...)
Affinity DataIC50:  34nM. Assay description: Mean inhibitory concentration against human peroxisome proliferator-activated receptor gamma
In DepthDetails ArticlePubMed
TargetPeroxisome proliferator-activated receptor alpha(Homo sapiens (Human))
Eli Lilly
Curated by ChEMBL
LigandPNGBDBM50157056((S)-2-Methoxy-3-{4-[3-(4-phenoxy-phenoxy)-propoxy]...)
Affinity DataIC50:  2.71E+3nM. Assay description: Agonist activity at PPARalpha
In DepthDetails ArticlePubMed
TargetPeroxisome proliferator-activated receptor gamma(Homo sapiens (Human))
Eli Lilly
Curated by ChEMBL
LigandPNGBDBM50157056((S)-2-Methoxy-3-{4-[3-(4-phenoxy-phenoxy)-propoxy]...)
Affinity DataEC50:  400nM. Assay description: Agonist activity at GAL4-fused PPARgamma assessed as transcriptional activity by cell based assay
In DepthDetails ArticlePubMed
TargetPeroxisome proliferator-activated receptor alpha(Homo sapiens (Human))
Eli Lilly
Curated by ChEMBL
LigandPNGBDBM50157056((S)-2-Methoxy-3-{4-[3-(4-phenoxy-phenoxy)-propoxy]...)
Affinity DataEC50:  2.80E+3nM. Assay description: Agonist activity at GAL4-fused PPARalpha assessed as transcriptional activity by cell based assay
In DepthDetails ArticlePubMed
TargetPeroxisome proliferator-activated receptor delta(Homo sapiens (Human))
Eli Lilly
Curated by ChEMBL
LigandPNGBDBM50157056((S)-2-Methoxy-3-{4-[3-(4-phenoxy-phenoxy)-propoxy]...)
Affinity DataIC50:  1.91E+3nM. Assay description: Agonist activity at PPARdelta
In DepthDetails ArticlePubMed
TargetPeroxisome proliferator-activated receptor gamma(Homo sapiens (Human))
Eli Lilly
Curated by ChEMBL
LigandPNGBDBM50157056((S)-2-Methoxy-3-{4-[3-(4-phenoxy-phenoxy)-propoxy]...)
Affinity DataIC50:  34.0nM. Assay description: Agonist activity at PPARgamma
In DepthDetails ArticlePubMed
TargetPeroxisome proliferator-activated receptor alpha(Homo sapiens (Human))
Eli Lilly
Curated by ChEMBL
LigandPNGBDBM50157056((S)-2-Methoxy-3-{4-[3-(4-phenoxy-phenoxy)-propoxy]...)
Affinity DataIC50:  2.71E+3nM. Assay description: Mean inhibitory concentration against human peroxisome proliferator activated receptor alpha
In DepthDetails ArticlePubMed