BDBM50157309 CHEMBL3780320
SMILES COc1ccccc1Nc1cc[nH]c(=O)c1C(=O)Nc1ccc(N2CCN(C)CC2)c(C)c1
InChI Key InChIKey=JVBRYDUIZXYSDV-UHFFFAOYSA-N
Data  1 KI
  Tab Delimited (TSV)   2D SDfile   Computed 3D by Vconf -m prep SDfile
Find this compound or compounds like it in BindingDB:
Activity Spreadsheet -- Enzyme Inhibition Constant Data from BindingDB
Found 1 hit for monomerid = 50157309
TargetEpidermal growth factor receptor(Homo sapiens (Human))
Genentech
Curated by ChEMBL
LigandPNGBDBM50157309(CHEMBL3780320)
Affinity DataKi:  26nM. Assay description: Inhibition of human EGFR catalytic domain (668 to 1210 residues) T790M/L858R double mutant using Fl-EEPLYWSFPAKKK-CONH2 peptide substrate preincubate...
In DepthDetails ArticlePubMed