BDBM50157348 (R)-1-{4-[4-(2-Methoxy-phenylsulfanyl)-3-trifluoromethyl-phenyl]-pyridin-2-yl}-pyrrolidin-3-ol::CHEMBL183226
SMILES COc1ccccc1Sc1ccc(cc1C(F)(F)F)-c1ccnc(c1)N1CC[C@@H](O)C1
InChI Key InChIKey=ROCDTGHUIQLNBL-QGZVFWFLSA-N
Data  1 IC50
  Tab Delimited (TSV)   2D SDfile   Computed 3D by Vconf -m prep SDfile
Find this compound or compounds like it in BindingDB:
Activity Spreadsheet -- Enzyme Inhibition Constant Data from BindingDB
Found 1 hit for monomerid = 50157348
TargetIntegrin alpha-L/Intercellular adhesion molecule 1(Homo sapiens (Human))
Abbott Laboratories
Curated by ChEMBL
LigandPNGBDBM50157348((R)-1-{4-[4-(2-Methoxy-phenylsulfanyl)-3-trifluoro...)
Affinity DataIC50:  77nM. Assay description: Inhibitory concentration against integrin LFA-1/ICAM-1 binding complex
In DepthDetails ArticlePubMed