BDBM50157361 2-{4''-[4-(2-Methoxy-phenylsulfanyl)-3-trifluoromethyl-phenyl]-3,4,5,6-tetrahydro-2H-[1,2'']bipyridinyl-4-yl}-ethanol::CHEMBL183884
SMILES COc1ccccc1Sc1ccc(cc1C(F)(F)F)-c1ccnc(c1)N1CCC(CCO)CC1
InChI Key InChIKey=VMYQJXMFOGNDIJ-UHFFFAOYSA-N
Data  1 IC50
  Tab Delimited (TSV)   2D SDfile   Computed 3D by Vconf -m prep SDfile
Find this compound or compounds like it in BindingDB:
Activity Spreadsheet -- Enzyme Inhibition Constant Data from BindingDB
Found 1 hit for monomerid = 50157361
TargetIntegrin alpha-L/Intercellular adhesion molecule 1(Homo sapiens (Human))
Abbott Laboratories
Curated by ChEMBL
LigandPNGBDBM50157361(2-{4''-[4-(2-Methoxy-phenylsulfanyl)-3-trifluorome...)
Affinity DataIC50:  111nM. Assay description: Inhibitory concentration against integrin LFA-1/ICAM-1 binding complex
In DepthDetails ArticlePubMed