BDBM50157398 (E)-1-(4-Acetyl-piperazin-1-yl)-3-[4-(2-isopropyl-phenylsulfanyl)-3-trifluoromethyl-phenyl]-propenone::CHEMBL360772
SMILES CC(C)c1ccccc1Sc1ccc(\C=C\C(=O)N2CCN(CC2)C(C)=O)cc1C(F)(F)F
InChI Key InChIKey=SSUCZPFAHCENOP-PKNBQFBNSA-N
Data  1 IC50
  Tab Delimited (TSV)   2D SDfile   Computed 3D by Vconf -m prep SDfile
Find this compound or compounds like it in BindingDB:
Activity Spreadsheet -- Enzyme Inhibition Constant Data from BindingDB
Found 1 hit for monomerid = 50157398
TargetIntegrin alpha-L/Intercellular adhesion molecule 1(Homo sapiens (Human))
Abbott Laboratories
Curated by ChEMBL
LigandPNGBDBM50157398((E)-1-(4-Acetyl-piperazin-1-yl)-3-[4-(2-isopropyl-...)
Affinity DataIC50:  60nM. Assay description: Inhibitory concentration against integrin LFA-1/ICAM-1 binding complex
In DepthDetails ArticlePubMed