BDBM50157619 CHEMBL3787072
SMILES C\C=C/C#Cc1ccc(CCC(O)=O)c(F)c1
InChI Key InChIKey=PGTJSAIUYORJJG-IHWYPQMZSA-N
Data  2 EC50
  Tab Delimited (TSV)   2D SDfile   Computed 3D by Vconf -m prep SDfile
Find this compound or compounds like it in BindingDB:
Activity Spreadsheet -- Enzyme Inhibition Constant Data from BindingDB
Found 2 hits for monomerid = 50157619
TargetFree fatty acid receptor 4(Homo sapiens (Human))
University Of Southern Denmark
Curated by ChEMBL
LigandPNGBDBM50157619(CHEMBL3787072)
Affinity DataEC50:  1.78E+4nM. Assay description: Agonist activity at human C-terminal YFP-tagged FFA4 receptor expressed in HEK293 cells incubated for 5 mins by BRET based beta-arrestin 2 recruitmen...
In DepthDetails ArticlePubMed
TargetFree fatty acid receptor 1(Homo sapiens (Human))
University Of Southern Denmark
Curated by ChEMBL
LigandPNGBDBM50157619(CHEMBL3787072)
Affinity DataEC50:  48nM. Assay description: Agonist activity at human FFA1 receptor expressed in human 1321N1 cells measured for 50 intervals of 0.4 secs by calcium mobilization assay
In DepthDetails ArticlePubMed