BDBM50157712 CHEMBL3785171
SMILES Cc1cccc2c1ncn(CC(=O)NCCc1ccccc1)c2=O
InChI Key InChIKey=KXRNCUODVDBYTC-UHFFFAOYSA-N
Data  1 IC50
  Tab Delimited (TSV)   2D SDfile   Computed 3D by Vconf -m prep SDfile
Find this compound or compounds like it in BindingDB:
Activity Spreadsheet -- Enzyme Inhibition Constant Data from BindingDB
Found 1 hit for monomerid = 50157712
LigandPNGBDBM50157712(CHEMBL3785171)
Affinity DataIC50: >8.33E+3nM. Assay description: Antagonist activity at human TRPA1 expressed in tetracycline-inducible T-REx expression system transfected CHO cells assessed as inhibition of AITC-i...
In DepthDetails ArticlePubMed