BDBM50157775 4-(4-methoxyphenyl)-N-(1,2,3,4-tetrahydronaphthalen-1-yl)-1-piperazinehexanamide::CHEMBL222507
SMILES COc1ccc(cc1)N1CCN(CCCCCC(=O)NC2CCCc3ccccc23)CC1
InChI Key InChIKey=IFTRKYHKXORNDG-UHFFFAOYSA-N
Data  1 KI
  Tab Delimited (TSV)   2D SDfile   Computed 3D by Vconf -m prep SDfile
Find this compound or compounds like it in BindingDB:
Activity Spreadsheet -- Enzyme Inhibition Constant Data from BindingDB
Found 1 hit for monomerid = 50157775
Target5-hydroxytryptamine receptor 7(Rattus norvegicus (rat))
Università
Curated by ChEMBL
LigandPNGBDBM50157775(4-(4-methoxyphenyl)-N-(1,2,3,4-tetrahydronaphthale...)
Affinity DataKi:  2.10E+3nM. Assay description: Displacement of [3H]LSD from rat recombinant 5HT7 receptor expressed in HEK293 cells
In DepthDetails ArticlePubMed