BDBM50157882 CHEMBL3785169
SMILES Nc1ncnc2n(cc(-c3cccc(OCCOC4CCCC4)c3)c12)[C@@H]1C[C@H](CN2CCC2)C1
InChI Key InChIKey=RPEGVUYQAYCTEZ-TYKWCNGQSA-N
Data  1 IC50
  Tab Delimited (TSV)   2D SDfile   Computed 3D by Vconf -m prep SDfile
Find this compound or compounds like it in BindingDB:
Activity Spreadsheet -- Enzyme Inhibition Constant Data from BindingDB
Found 1 hit for monomerid = 50157882
TargetInsulin-like growth factor 1 receptor(Homo sapiens (Human))
Novartis Institutes For Biomedical Research
Curated by ChEMBL
LigandPNGBDBM50157882(CHEMBL3785169)
Affinity DataIC50:  490nM. Assay description: Inhibition of IGF-1 receptor (unknown origin)
In DepthDetails ArticlePubMed