BDBM50158 (2E,3Z)-2-[ethoxy(hydroxy)methylene]-3-(4-propylbenzylidene)tetralin-1,4-quinone::(2E,3Z)-2-[ethoxy(hydroxy)methylidene]-3-[(4-propylphenyl)methylidene]naphthalene-1,4-dione::(2E,3Z)-2-[ethoxy(oxidanyl)methylidene]-3-[(4-propylphenyl)methylidene]naphthalene-1,4-dione::MLS000571357::SMR000193442::cid_5337202::ethyl 1-hydroxy-4-oxo-3-(4-propylbenzylidene)-3,4-dihydro-2-naphthalenecarboxylate
SMILES CCCc1ccc(CC2=C(C(=O)OCC)C(=O)c3ccccc3C2=O)cc1
InChI Key InChIKey=NHIDBSJWSDETCX-UHFFFAOYSA-N
Data  5 IC50
  Tab Delimited (TSV)   2D SDfile   Computed 3D by Vconf -m prep SDfile
Find this compound or compounds like it in BindingDB:
Activity Spreadsheet -- Enzyme Inhibition Constant Data from BindingDB
Found 5 hits for monomerid = 50158
TargetInduced myeloid leukemia cell differentiation protein Mcl-1(Homo sapiens (Human))
Emory University
Curated by PubChem BioAssay
LigandPNGBDBM50158((2E,3Z)-2-[ethoxy(hydroxy)methylene]-3-(4-propylbe...)
Affinity DataIC50:  2.32E+3nM. Assay description: NIH Molecular Libraries Screening Centers Network [MLSCN] Emory Chemical Biology Discovery Center in MLSCN Assay provider: Nikolovska-Coleska, Univer...
In DepthDetails PCBioAssay
TargetAmyloid-beta A4 precursor protein-binding family A member 1(Rattus norvegicus)
Burnham Center For Chemical Genomics
Curated by PubChem BioAssay
LigandPNGBDBM50158((2E,3Z)-2-[ethoxy(hydroxy)methylene]-3-(4-propylbe...)
Affinity DataIC50:  5.12E+3nM. Assay description: Data Source: Sanford-Burnham Center for Chemical Genomics (SBCCG) Source Affiliation: Sanford-Burnham Medical Research Institute (SBMRI, San Diego, C...
In DepthDetails PCBioAssay
TargetAmyloid-beta A4 precursor protein-binding family A member 1(Rattus norvegicus)
Burnham Center For Chemical Genomics
Curated by PubChem BioAssay
LigandPNGBDBM50158((2E,3Z)-2-[ethoxy(hydroxy)methylene]-3-(4-propylbe...)
Affinity DataIC50:  5.70E+3nM. Assay description: Data Source: Sanford-Burnham Center for Chemical Genomics (SBCCG) Source Affiliation: Sanford-Burnham Medical Research Institute (SBMRI, San Diego, C...
In DepthDetails PCBioAssay
TargetAmyloid-beta A4 precursor protein-binding family A member 1(Rattus norvegicus)
Burnham Center For Chemical Genomics
Curated by PubChem BioAssay
LigandPNGBDBM50158((2E,3Z)-2-[ethoxy(hydroxy)methylene]-3-(4-propylbe...)
Affinity DataIC50:  7.19E+3nM. Assay description: Data Source: Sanford-Burnham Center for Chemical Genomics (SBCCG) Source Affiliation: Sanford-Burnham Medical Research Institute (SBMRI, San Diego, C...
In DepthDetails PCBioAssay
TargetVoltage-dependent N-type calcium channel subunit alpha-1B(Homo sapiens (Human))
Burnham Center For Chemical Genomics
Curated by PubChem BioAssay
LigandPNGBDBM50158((2E,3Z)-2-[ethoxy(hydroxy)methylene]-3-(4-propylbe...)
Affinity DataIC50:  9.62E+3nM. Assay description: Data Source: Data Source: Sanford-Burnham Center for Chemical Genomics (SBCCG) Source Affiliation: Sanford-Burnham Medical Research Institute Network...
In DepthDetails PCBioAssay