BDBM50158027 4-[5-Methoxy-3-(1,2,3,6-tetrahydro-pyridin-4-yl)-indole-1-sulfonyl]-phenylamine::CHEMBL181066
SMILES COc1ccc2n(cc(C3=CCNCC3)c2c1)S(=O)(=O)c1ccc(N)cc1
InChI Key InChIKey=FXJNMAADTCUZOE-UHFFFAOYSA-N
Data  3 KI  1 IC50
  Tab Delimited (TSV)   2D SDfile   Computed 3D by Vconf -m prep SDfile
Find this compound or compounds like it in BindingDB:
Activity Spreadsheet -- Enzyme Inhibition Constant Data from BindingDB
Found 4 hits for monomerid = 50158027
Target5-hydroxytryptamine receptor 6(Homo sapiens (Human))
Wyeth Research
Curated by ChEMBL
LigandPNGBDBM50158027(4-[5-Methoxy-3-(1,2,3,6-tetrahydro-pyridin-4-yl)-i...)
Affinity DataKi:  3nM. Assay description: Binding affinity against cloned human 5-hydroxytryptamine 6 receptor expressed in HeLa cells using [3H]-LSD
In DepthDetails ArticlePubMed
Target5-hydroxytryptamine receptor 1A(Homo sapiens (Human))
Wyeth Research
Curated by ChEMBL
LigandPNGBDBM50158027(4-[5-Methoxy-3-(1,2,3,6-tetrahydro-pyridin-4-yl)-i...)
Affinity DataKi:  97nM. Assay description: Binding affinity against human cloned 5-hydroxytryptamine 1A receptor stably expressed in CHO cells using [3H]-5-HT
In DepthDetails ArticlePubMed
Target5-hydroxytryptamine receptor 7(Homo sapiens (Human))
Wyeth Research
Curated by ChEMBL
LigandPNGBDBM50158027(4-[5-Methoxy-3-(1,2,3,6-tetrahydro-pyridin-4-yl)-i...)
Affinity DataKi: >5.00E+3nM. Assay description: Binding affinity against human cloned 5-hydroxytryptamine 7 receptor stably expressed in CHO cells using [3H]-LSD
In DepthDetails ArticlePubMed
Target5-hydroxytryptamine receptor 6(Homo sapiens (Human))
Wyeth Research
Curated by ChEMBL
LigandPNGBDBM50158027(4-[5-Methoxy-3-(1,2,3,6-tetrahydro-pyridin-4-yl)-i...)
Affinity DataIC50:  0.400nM. Assay description: Inhibitory concentration against 5-HT stimulated cAMP production in HeLa cells stably transfected with human 5-HT6 receptor
In DepthDetails ArticlePubMed