BDBM50158098 CHEMBL3780385
SMILES OC(=O)c1cc(c2ccccc2c1O)S(=O)(=O)N1CCN(CC1)c1ccccc1
InChI Key InChIKey=ORKWHMREWDJSCF-UHFFFAOYSA-N
Data  1 KI
  Tab Delimited (TSV)   2D SDfile   Computed 3D by Vconf -m prep SDfile
Find this compound or compounds like it in BindingDB:
Activity Spreadsheet -- Enzyme Inhibition Constant Data from BindingDB
Found 1 hit for monomerid = 50158098
TargetInduced myeloid leukemia cell differentiation protein Mcl-1(Homo sapiens (Human))
University Of Maryland
Curated by ChEMBL
LigandPNGBDBM50158098(CHEMBL3780385)
Affinity DataKi:  4.54E+3nM. Assay description: Inhibition of His6-MBP tagged recombinant human Mcl-1 residues 172 to 327 expressed in Escherichia coli assessed as inhibition of interaction with Ba...
In DepthDetails ArticlePubMed