BDBM50158203 Aceticacid(R)-1-[(4R,4aR,5S,6R,6aR,11bS)-4,5,6-triacetoxy--hydroxy-2,4a,11b-trimethyl-1-(3-phenyl-propyl)-1,2,3,4,4a,b,5,6,9,11a,11b,12,13,13a-tetradecahydro-8-oxa-cyclohepta[a]phenanthren-6a-yl]-ethyl ester::CHEMBL362446
SMILES C[C@@H](OC(C)=O)[C@]12COCC=CC1[C@]1(C)CCC3C(O)(CCCc4ccccc4)C(C)=C[C@@H](OC(C)=O)[C@]3(C)C1[C@H](OC(C)=O)[C@@H]2OC(C)=O
InChI Key InChIKey=AFEGSFWAVVEGCD-CMZXHQBKSA-N
Data  1 IC50
  Tab Delimited (TSV)   2D SDfile   Computed 3D by Vconf -m prep SDfile
Find this compound or compounds like it in BindingDB:
Activity Spreadsheet -- Enzyme Inhibition Constant Data from BindingDB
Found 1 hit for monomerid = 50158203
TargetPotassium voltage-gated channel subfamily A member 3(Homo sapiens (Human))
Merck Research Laboratories
Curated by ChEMBL
LigandPNGBDBM50158203(Aceticacid(R)-1-[(4R,4aR,5S,6R,6aR,11bS)-4,5,6-tri...)
Affinity DataIC50:  150nM. Assay description: Inhibition of voltage-gated potassium channel subunit Kv1.3 in chinese hamster ovary cells
In DepthDetails ArticlePubMed