BDBM50158397 CHEMBL3780836
SMILES NC(=O)[C@@H]1CCCN1C(=O)[C@H](Cc1nc(Cl)[nH]c1Cl)NC(=O)[C@@H]1CCC(=O)N1
InChI Key InChIKey=GRDMLSZQORSINF-HGNGGELXSA-N
Data  2 IC50  4 EC50
  Tab Delimited (TSV)   2D SDfile   Computed 3D by Vconf -m prep SDfile
Find this compound or compounds like it in BindingDB:
Activity Spreadsheet -- Enzyme Inhibition Constant Data from BindingDB
Found 6 hits for monomerid = 50158397
TargetThyrotropin-releasing hormone receptor(MOUSE)
National Institute Of Pharmaceutical Education And Research
Curated by ChEMBL
LigandPNGBDBM50158397(CHEMBL3780836)
Affinity DataIC50: >5.00E+4nM. Assay description: Displacement of [3H]-Me-His-TRH from mouse TRH-R1 expressed in HEK293 cells preincubated for 15 mins measured after 4 hrs
In DepthDetails ArticlePubMed
TargetThyrotropin-releasing hormone receptor(Mus musculus)
National Institute Of Pharmaceutical Education And Research
Curated by ChEMBL
LigandPNGBDBM50158397(CHEMBL3780836)
Affinity DataEC50:  360nM. Assay description: Agonist activity at mouse TRH-R2 expressed in HEK293 cells assessed as Ca2+ release by FLIPR assay
In DepthDetails ArticlePubMed
TargetThyrotropin-releasing hormone receptor(Mus musculus)
National Institute Of Pharmaceutical Education And Research
Curated by ChEMBL
LigandPNGBDBM50158397(CHEMBL3780836)
Affinity DataEC50:  380nM. Assay description: Agonist activity at mouse TRH-R2 expressed in HEK293 cells assessed as IP1 formation after 1 hr by ELISA
In DepthDetails ArticlePubMed
TargetThyrotropin-releasing hormone receptor(Mus musculus)
National Institute Of Pharmaceutical Education And Research
Curated by ChEMBL
LigandPNGBDBM50158397(CHEMBL3780836)
Affinity DataIC50: >5.00E+4nM. Assay description: Displacement of [3H]-Me-His-TRH from mouse TRH-R2 expressed in HEK293 cells preincubated for 15 mins measured after 4 hrs
In DepthDetails ArticlePubMed
TargetThyrotropin-releasing hormone receptor(MOUSE)
National Institute Of Pharmaceutical Education And Research
Curated by ChEMBL
LigandPNGBDBM50158397(CHEMBL3780836)
Affinity DataEC50:  5.97E+3nM. Assay description: Agonist activity at mouse TRH-R1 expressed in HEK293 cells assessed as Ca2+ release by FLIPR assay
In DepthDetails ArticlePubMed
TargetThyrotropin-releasing hormone receptor(MOUSE)
National Institute Of Pharmaceutical Education And Research
Curated by ChEMBL
LigandPNGBDBM50158397(CHEMBL3780836)
Affinity DataEC50:  1.29E+4nM. Assay description: Agonist activity at mouse TRH-R1 expressed in HEK293 cells assessed as IP1 formation after 1 hr by ELISA
In DepthDetails ArticlePubMed