BDBM50158440 CHEMBL387879::N-[3-(2,4-dichlorophenoxy)-4-pyridinyl]trifluoromethanesulfonamide
SMILES FC(F)(F)S(=O)(=O)Nc1ccncc1Oc1ccc(Cl)cc1Cl
InChI Key InChIKey=KJCDNRSCHQWHKE-UHFFFAOYSA-N
Data  2 IC50
  Tab Delimited (TSV)   2D SDfile   Computed 3D by Vconf -m prep SDfile
Find this compound or compounds like it in BindingDB:
Activity Spreadsheet -- Enzyme Inhibition Constant Data from BindingDB
Found 2 hits for monomerid = 50158440
TargetProstaglandin G/H synthase 2(Homo sapiens (Human))
Université
Curated by ChEMBL
LigandPNGBDBM50158440(CHEMBL387879 | N-[3-(2,4-dichlorophenoxy)-4-pyridi...)
Affinity DataIC50:  2.55E+3nM. Assay description: Inhibition of COX2 in human whole blood assessed as inhibition of LPS-stimulated PGE2 production
In DepthDetails ArticlePubMed
TargetProstaglandin G/H synthase 1(Homo sapiens (Human))
Université
Curated by ChEMBL
LigandPNGBDBM50158440(CHEMBL387879 | N-[3-(2,4-dichlorophenoxy)-4-pyridi...)
Affinity DataIC50:  1.37E+3nM. Assay description: Inhibition of COX1 in human whole blood assessed as inhibition of calcium ionophore A-23187-stimulated platelet aggregation by measuring TXB2 product...
In DepthDetails ArticlePubMed