BDBM50158549 CHEMBL3782011
SMILES COc1cccc(c1)N1CC(=O)C(=C1N)c1nc2ccccc2[nH]1
InChI Key InChIKey=GTMGTHFMAKPBFX-UHFFFAOYSA-N
Data  1 IC50
  Tab Delimited (TSV)   2D SDfile   Computed 3D by Vconf -m prep SDfile
Find this compound or compounds like it in BindingDB:
Activity Spreadsheet -- Enzyme Inhibition Constant Data from BindingDB
Found 1 hit for monomerid = 50158549
TargetFibroblast growth factor receptor 1(Homo sapiens (Human))
Nas Of Ukraine
Curated by ChEMBL
LigandPNGBDBM50158549(CHEMBL3782011)
Affinity DataIC50:  3.50E+3nM. Assay description: Inhibition of N-terminal GST-tagged recombinant human FGFR1 (456 to 765 residues) expressed in baculovirus infected insect Sf21 cells after 25 mins u...
In DepthDetails ArticlePubMed