BDBM50159040 Ac-I[CVVQDWGHHRC]T-NH2::CHEMBL409335
SMILES CC[C@H](C)[C@H](NC(C)=O)C(=O)N[C@H]1CSSC[C@H](NC(=O)[C@H](CCCNC(N)=N)NC(=O)[C@@H](Cc2cnc[nH]2)NC(=O)[C@H](Cc2cnc[nH]2)NC(=O)CNC(=O)[C@H](Cc2c[nH]c3ccccc23)NC(=O)[C@@H](CC(O)=O)NC(=O)[C@H](CCC(N)=O)NC(=O)[C@H](NC(=O)[C@@H](NC1=O)C(C)C)C(C)C)C(=O)N[C@@H]([C@@H](C)O)C(N)=O
InChI Key InChIKey=OWNUFKXWXAAHMZ-LERXPYHNSA-N
Data  1 IC50
  Tab Delimited (TSV)   2D SDfile   Computed 3D by Vconf -m prep SDfile
Find this compound or compounds like it in BindingDB:
Activity Spreadsheet -- Enzyme Inhibition Constant Data from BindingDB
Found 1 hit for monomerid = 50159040
TargetComplement C3(Homo sapiens (Human))
University Of California Riverside
Curated by ChEMBL
LigandPNGBDBM50159040(Ac-I[CVVQDWGHHRC]T-NH2 | CHEMBL409335)
Affinity DataIC50:  3.20E+4nM. Assay description: Inhibitory concentration for human complement component C3 activation
In DepthDetails ArticlePubMed