BDBM50159199 4-Isopropyl-N-(3-(R)-1-pyrrolidin-2-ylmethyl-1H-indol-5-yl)-benzenesulfonamide
SMILES CC(C)c1ccc(cc1)S(=O)(=O)Nc1ccc2[nH]cc(CC3CCCN3)c2c1
InChI Key InChIKey=KTTVLQCVCOFIAK-UHFFFAOYSA-N
Data  1 KI
  Tab Delimited (TSV)   2D SDfile   Computed 3D by Vconf -m prep SDfile
Find this compound or compounds like it in BindingDB:
Activity Spreadsheet -- Enzyme Inhibition Constant Data from BindingDB
Found 1 hit for monomerid = 50159199
Target5-hydroxytryptamine receptor 6(Homo sapiens (Human))
Wyeth Research
Curated by ChEMBL
LigandPNGBDBM50159199(4-Isopropyl-N-(3-(R)-1-pyrrolidin-2-ylmethyl-1H-in...)
Affinity DataKi:  1nM. Assay description: Inhibition of [3H]LSD binding to human 5-hydroxytryptamine 6 receptor expressed in HeLa cells
In DepthDetails ArticlePubMed