BDBM50159219 5-Chloro-6-(4-nitro-imidazol-1-ylmethyl)-1H-pyrimidine-2,4-dione::CHEMBL195864
SMILES [O-][N+](=O)c1cn(Cc2[n-]c(=[OH+])[nH]c(=O)c2Cl)cn1
InChI Key InChIKey=SGTJZAHLXLCQGW-UHFFFAOYSA-N
Data  2 IC50
  Tab Delimited (TSV)   2D SDfile   Computed 3D by Vconf -m prep SDfile
Find this compound or compounds like it in BindingDB:
Activity Spreadsheet -- Enzyme Inhibition Constant Data from BindingDB
Found 2 hits for monomerid = 50159219
TargetThymidine phosphorylase(Homo sapiens (Human))
University Of Manchester
Curated by ChEMBL
LigandPNGBDBM50159219(5-Chloro-6-(4-nitro-imidazol-1-ylmethyl)-1H-pyrimi...)
Affinity DataIC50:  2.00E+5nM. Assay description: Inhibitory concentration against human thymidine phosphorylase
In DepthDetails ArticlePubMed
TargetThymidine phosphorylase(Escherichia coli)
University Of Manchester
Curated by ChEMBL
LigandPNGBDBM50159219(5-Chloro-6-(4-nitro-imidazol-1-ylmethyl)-1H-pyrimi...)
Affinity DataIC50:  7.00E+3nM. Assay description: Inhibitory concentration against thymidine phosphorylase of Escherichia coli
In DepthDetails ArticlePubMed