BDBM50159286 CHEMBL3787131
SMILES Fc1ccc(cc1)-c1nnc(o1)C(=O)N1CCC(CC1)Oc1ccc(CN2CCCC2)cc1
InChI Key InChIKey=NLCAWELXTDCMEL-UHFFFAOYSA-N
Data  2 IC50
  Tab Delimited (TSV)   2D SDfile   Computed 3D by Vconf -m prep SDfile
Find this compound or compounds like it in BindingDB:
Activity Spreadsheet -- Enzyme Inhibition Constant Data from BindingDB
Found 2 hits for monomerid = 50159286
TargetPotassium voltage-gated channel subfamily H member 2(Homo sapiens (Human))
Astrazeneca
Curated by ChEMBL
LigandPNGBDBM50159286(CHEMBL3787131)
Affinity DataIC50:  6.20E+3nM. Assay description: Inhibition of human ERG by IonWork assay
In DepthDetails ArticlePubMed
TargetMelanin-concentrating hormone receptor 1(Homo sapiens (Human))
Astrazeneca
Curated by ChEMBL
LigandPNGBDBM50159286(CHEMBL3787131)
Affinity DataIC50:  44nM. Assay description: Antagonist activity at human MCHR1 expressed in CHO cell membranes preincubated for 5 mins followed by addition of MCH peptide measured after 45 mins...
In DepthDetails ArticlePubMed