BDBM50159331 CHEMBL3787582
SMILES CN1CCN(Cc2ccc(OC3CN(C3)C(=O)c3nnc(o3)-c3ccccc3)cc2F)CC1
InChI Key InChIKey=UTJXTQGALFXJGW-UHFFFAOYSA-N
Data  2 IC50
  Tab Delimited (TSV)   2D SDfile   Computed 3D by Vconf -m prep SDfile
Find this compound or compounds like it in BindingDB:
Activity Spreadsheet -- Enzyme Inhibition Constant Data from BindingDB
Found 2 hits for monomerid = 50159331
TargetMelanin-concentrating hormone receptor 1(Homo sapiens (Human))
Astrazeneca
Curated by ChEMBL
LigandPNGBDBM50159331(CHEMBL3787582)
Affinity DataIC50:  93nM. Assay description: Antagonist activity at human MCHR1 expressed in CHO cell membranes preincubated for 5 mins followed by addition of MCH peptide measured after 45 mins...
In DepthDetails ArticlePubMed
TargetPotassium voltage-gated channel subfamily H member 2(Homo sapiens (Human))
Astrazeneca
Curated by ChEMBL
LigandPNGBDBM50159331(CHEMBL3787582)
Affinity DataIC50: >3.30E+4nM. Assay description: Inhibition of human ERG by IonWork assay
In DepthDetails ArticlePubMed