BDBM50159394 CHEMBL386023::Des-AA1,2,5-[D-Trp8,IAmp9]SRIF CH-275
SMILES CC(C)NCc1ccc(C[C@@H]2NC(=O)[C@H](Cc3c[nH]c4ccccc34)NC(=O)[C@H](Cc3ccccc3)NC(=O)[C@@H](Cc3ccccc3)NC(=O)[C@@H](CCCCN)NC(=O)[C@H](N)CSSC[C@H](NC(=O)[C@H](CO)NC(=O)[C@H](NC(=O)[C@H](Cc3ccccc3)NC(=O)[C@H](NC2=O)[C@@H](C)O)[C@@H](C)O)C(O)=O)cc1
InChI Key InChIKey=SYHQUPOPQRNSKD-ZDFJKKNGSA-N
Data  5 IC50
  Tab Delimited (TSV)   2D SDfile   Computed 3D by Vconf -m prep SDfile
Find this compound or compounds like it in BindingDB:
Activity Spreadsheet -- Enzyme Inhibition Constant Data from BindingDB
Found 5 hits for monomerid = 50159394
TargetSomatostatin receptor type 4(Homo sapiens (Human))
Salk Institute
Curated by ChEMBL
LigandPNGBDBM50159394(CHEMBL386023 | Des-AA1,2,5-[D-Trp8,IAmp9]SRIF CH-2...)
Affinity DataIC50: >1.00E+3nM. Assay description: Inhibition of [Leu8,D-Trp22,125I-Tyr25]SRIF-28 binding to human somatostatin receptor type 4
In DepthDetails ArticlePubMed
TargetSomatostatin receptor type 3(Homo sapiens (Human))
Salk Institute
Curated by ChEMBL
LigandPNGBDBM50159394(CHEMBL386023 | Des-AA1,2,5-[D-Trp8,IAmp9]SRIF CH-2...)
Affinity DataIC50:  345nM. Assay description: Inhibition of [Leu8,D-Trp22,125I-Tyr25]SRIF-28 binding to human somatostatin receptor type 3
In DepthDetails ArticlePubMed
TargetSomatostatin receptor type 2(Homo sapiens (Human))
Salk Institute
Curated by ChEMBL
LigandPNGBDBM50159394(CHEMBL386023 | Des-AA1,2,5-[D-Trp8,IAmp9]SRIF CH-2...)
Affinity DataIC50: >1.00E+3nM. Assay description: Inhibition of [Leu8,D-Trp22,125I-Tyr25]SRIF-28 binding to human somatostatin receptor type 2
In DepthDetails ArticlePubMed
TargetSomatostatin receptor type 5(Homo sapiens (Human))
Salk Institute
Curated by ChEMBL
LigandPNGBDBM50159394(CHEMBL386023 | Des-AA1,2,5-[D-Trp8,IAmp9]SRIF CH-2...)
Affinity DataIC50: >1.00E+3nM. Assay description: Inhibition of [Leu8,D-Trp22,125I-Tyr25]SRIF-28 binding to human somatostatin receptor type 5
In DepthDetails ArticlePubMed
TargetSomatostatin receptor type 1(Homo sapiens (Human))
Salk Institute
Curated by ChEMBL
LigandPNGBDBM50159394(CHEMBL386023 | Des-AA1,2,5-[D-Trp8,IAmp9]SRIF CH-2...)
Affinity DataIC50:  33nM. Assay description: Inhibition of [Leu8,D-Trp22,125I-Tyr25]SRIF-28 binding to human somatostatin receptor type 1
In DepthDetails ArticlePubMed