BDBM50159534 2-[(Z)-2-(3,4-Dimethoxy-5-nitro-phenyl)-vinyl]-naphthalene::CHEMBL180024
SMILES COc1cc(\C=C/c2ccc3ccccc3c2)cc(c1OC)[N+]([O-])=O
InChI Key InChIKey=HMBHLSFDCBXYET-FPLPWBNLSA-N
Data  1 IC50
  Tab Delimited (TSV)   2D SDfile   Computed 3D by Vconf -m prep SDfile
Find this compound or compounds like it in BindingDB:
Activity Spreadsheet -- Enzyme Inhibition Constant Data from BindingDB
Found 1 hit for monomerid = 50159534
TargetTubulin beta-2B chain(Bos taurus)
Universidad De Salamanca
Curated by ChEMBL
LigandPNGBDBM50159534(2-[(Z)-2-(3,4-Dimethoxy-5-nitro-phenyl)-vinyl]-nap...)
Affinity DataIC50:  1.30E+4nM. Assay description: In vitro inhibitory concentration value against bovine brain tubulin polymerization
In DepthDetails ArticlePubMed