BDBM50159620 2-Morpholin-4-yl-pyrimido[2,1-a]isoquinolin-4-one::2-morpholino-4H-pyrimido[2,1-a]isoquinolin-4-one::CHEMBL179242
SMILES O=c1cc(nc2c3ccccc3ccn12)N1CCOCC1
InChI Key InChIKey=BVRDQVRQVGRNHG-UHFFFAOYSA-N
Data  8 IC50
  Tab Delimited (TSV)   2D SDfile   Computed 3D by Vconf -m prep SDfile
Find this compound or compounds like it in BindingDB:
Activity Spreadsheet -- Enzyme Inhibition Constant Data from BindingDB
Found 8 hits for monomerid = 50159620
TargetDNA-dependent protein kinase catalytic subunit(Homo sapiens (Human))
Newcastle University
Curated by ChEMBL
LigandPNGBDBM50159620(2-Morpholin-4-yl-pyrimido[2,1-a]isoquinolin-4-one ...)
Affinity DataIC50:  280nM. Assay description: Inhibition of DNA dependent protein kinase isolated from HeLa cells
In DepthDetails ArticlePubMed
LigandPNGBDBM50159620(2-Morpholin-4-yl-pyrimido[2,1-a]isoquinolin-4-one ...)
Affinity DataIC50: >1.00E+5nM. Assay description: Inhibition of p110alpha/p85-alpha PI3K
In DepthDetails ArticlePubMed
TargetDNA-dependent protein kinase catalytic subunit(Homo sapiens (Human))
Newcastle University
Curated by ChEMBL
LigandPNGBDBM50159620(2-Morpholin-4-yl-pyrimido[2,1-a]isoquinolin-4-one ...)
Affinity DataIC50:  280nM. Assay description: Inhibition of DNA-PK
In DepthDetails ArticlePubMed
TargetSerine/threonine-protein kinase mTOR(Homo sapiens (Human))
Stony Brook University
Curated by ChEMBL
LigandPNGBDBM50159620(2-Morpholin-4-yl-pyrimido[2,1-a]isoquinolin-4-one ...)
Affinity DataIC50:  5.30E+3nM. Assay description: Inhibition of mTOR
In DepthDetails ArticlePubMed
TargetSerine/threonine-protein kinase ATR(Homo sapiens (Human))
Newcastle University
Curated by ChEMBL
LigandPNGBDBM50159620(2-Morpholin-4-yl-pyrimido[2,1-a]isoquinolin-4-one ...)
Affinity DataIC50: >1.00E+5nM. Assay description: Inhibition of ATR kinase using rabbit polyclonal antisera
In DepthDetails ArticlePubMed
TargetPhosphatidylinositol 4,5-bisphosphate 3-kinase catalytic subunit alpha isoform(Homo sapiens (Human))
Newcastle University
Curated by ChEMBL
LigandPNGBDBM50159620(2-Morpholin-4-yl-pyrimido[2,1-a]isoquinolin-4-one ...)
Affinity DataIC50: >1.00E+5nM. Assay description: Inhibition of Phosphatidylinositol 3-kinase
In DepthDetails ArticlePubMed
TargetSerine/threonine-protein kinase mTOR(Homo sapiens (Human))
Stony Brook University
Curated by ChEMBL
LigandPNGBDBM50159620(2-Morpholin-4-yl-pyrimido[2,1-a]isoquinolin-4-one ...)
Affinity DataIC50:  5.30E+3nM. Assay description: Inhibition of mTOR protein isolated from HeLa cells
In DepthDetails ArticlePubMed
TargetSerine-protein kinase ATM(Homo sapiens (Human))
Newcastle University
Curated by ChEMBL
LigandPNGBDBM50159620(2-Morpholin-4-yl-pyrimido[2,1-a]isoquinolin-4-one ...)
Affinity DataIC50: >1.00E+5nM. Assay description: Inhibition of ATM kinase using rabbit polyclonal antisera
In DepthDetails ArticlePubMed