BDBM50159737 14-(2-benzylanilinoethyl)-16-methyl-6,14-diazatetracyclo[7.5.3.01,10.02,7]heptadeca-2(7),3,16-trien-5-one::CHEMBL362433
SMILES CC1=C[C@H]2Cc3[nH]c(=O)ccc3[C@@]3(C1)[C@@H]2CCCN3CCN(Cc1ccccc1)c1ccccc1
InChI Key InChIKey=VQLMHRMGNLYMOU-ZRLKGHKBSA-N
Data  1 IC50
  Tab Delimited (TSV)   2D SDfile   Computed 3D by Vconf -m prep SDfile
Find this compound or compounds like it in BindingDB:
Activity Spreadsheet -- Enzyme Inhibition Constant Data from BindingDB
Found 1 hit for monomerid = 50159737
TargetAcetylcholinesterase(Rattus norvegicus (rat))
Chinese Academy Of Sciences
Curated by ChEMBL
LigandPNGBDBM50159737(14-(2-benzylanilinoethyl)-16-methyl-6,14-diazatetr...)
Affinity DataIC50: >5.40E+4nM. Assay description: Inhibitory concentration against acetylcholinesterase from rat cortex homogenate by ellman method was determined
In DepthDetails ArticlePubMed